BDBM50089560 5-(Hepta-2,4-diynyl-methyl-amino)-3,4-dihydro-1H-quinolin-2-one::CHEMBL35671
SMILES CCC#CC#CCN(C)c1cccc2NC(=O)CCc12
InChI Key InChIKey=QKLQLNRQVUXLDG-UHFFFAOYSA-N
Data  2 IC50
  Tab Delimited (TSV)   2D SDfile   Computed 3D by Vconf -m prep SDfile
Find this compound or compounds like it in BindingDB:
Activity Spreadsheet -- Enzyme Inhibition Constant Data from BindingDB
Found 2 hits for monomerid = 50089560
TargetChitin synthase 3(Candida albicans)TBA
LigandPNGBDBM50089560(5-(Hepta-2,4-diynyl-methyl-amino)-3,4-dihydro-1H-q...)
Affinity DataIC50:  2.96E+4nM. Assay description: Inhibition of Candida albicans chitin synthase
In DepthDetails Article
TargetChitin synthase 1(Candida albicans)
Nippon Roche Research Center
Curated by ChEMBL
LigandPNGBDBM50089560(5-(Hepta-2,4-diynyl-methyl-amino)-3,4-dihydro-1H-q...)
Affinity DataIC50:  7.90nM. Assay description: Inhibitory of Candida albicans chitin synthase 1
In DepthDetails ArticlePubMed