BDBM50089574 CHEMBL3578204
SMILES CCCCSc1nc(Nc2cccc(Cl)c2)c2cnn(CC(Cl)c3ccccc3)c2n1
InChI Key InChIKey=IYEUMUXJWLJKDF-UHFFFAOYSA-N
Data  1 KI
  Tab Delimited (TSV)   2D SDfile   Computed 3D by Vconf -m prep SDfile
Find this compound or compounds like it in BindingDB:
Activity Spreadsheet -- Enzyme Inhibition Constant Data from BindingDB
Found 1 hit for monomerid = 50089574
TargetTyrosine-protein kinase Fyn(Homo sapiens (Human))
Universit£
Curated by ChEMBL
LigandPNGBDBM50089574(CHEMBL3578204)
Affinity DataKi:  1.40E+3nM. Assay description: Inhibition of human recombinant full-length Fyn using Src substrate peptide after 15 mins incubation by MicroBeta liquid scintillation counting analy...
In DepthDetails ArticlePubMed