BDBM50089576 CHEMBL3578213
SMILES Nc1ncnc2n(CC(Cl)c3ccccc3)nc(-c3ccc(F)cc3)c12
InChI Key InChIKey=DMATXWLHUWDWHH-UHFFFAOYSA-N
Data  1 KI
  Tab Delimited (TSV)   2D SDfile   Computed 3D by Vconf -m prep SDfile
Find this compound or compounds like it in BindingDB:
Activity Spreadsheet -- Enzyme Inhibition Constant Data from BindingDB
Found 1 hit for monomerid = 50089576
TargetTyrosine-protein kinase Fyn(Homo sapiens (Human))
Universit£
Curated by ChEMBL
LigandPNGBDBM50089576(CHEMBL3578213)
Affinity DataKi:  360nM. Assay description: Inhibition of human recombinant full-length Fyn using Src substrate peptide after 15 mins incubation by MicroBeta liquid scintillation counting analy...
In DepthDetails ArticlePubMed