BDBM50089579 CHEMBL3578208
SMILES CCC(C)Sc1nc(Nc2cccc(Cl)c2)c2cnn(CC(Cl)c3ccccc3)c2n1
InChI Key InChIKey=HYGBJLNYUIUASU-UHFFFAOYSA-N
Data  1 KI
  Tab Delimited (TSV)   2D SDfile   Computed 3D by Vconf -m prep SDfile
Find this compound or compounds like it in BindingDB:
Activity Spreadsheet -- Enzyme Inhibition Constant Data from BindingDB
Found 1 hit for monomerid = 50089579
TargetTyrosine-protein kinase Fyn(Homo sapiens (Human))
Universit£
Curated by ChEMBL
LigandPNGBDBM50089579(CHEMBL3578208)
Affinity DataKi:  1.25E+4nM. Assay description: Inhibition of human recombinant full-length Fyn using Src substrate peptide after 15 mins incubation by MicroBeta liquid scintillation counting analy...
In DepthDetails ArticlePubMed