BDBM50089632 CHEMBL3578275
SMILES C[C@@H](N1C(=O)O[C@@](Cc2ccccc2)(C1=O)c1nc2cc(OC(F)(F)F)ccc2[nH]1)c1ccc(F)cc1
InChI Key
Data  1 IC50
  Tab Delimited (TSV)   2D SDfile   Computed 3D by Vconf -m prep SDfile
Find this compound or compounds like it in BindingDB:
Activity Spreadsheet -- Enzyme Inhibition Constant Data from BindingDB
Found 1 hit for monomerid = 50089632
TargetMineralocorticoid receptor(Homo sapiens (Human))
Merck Research Laboratories
Curated by ChEMBL
LigandPNGBDBM50089632(CHEMBL3578275)
Affinity DataIC50:  180nM. Assay description: Antagonist activity at human mineralocorticoid receptor overexpressed in CHOK1 cells assessed as inhibition of aldosterone-induced protein interactio...
In DepthDetails ArticlePubMed