BDBM50089828 4-(3-Chloro-4-methoxy-benzylamino)-1-(4-hydroxy-piperidin-1-yl)-phthalazine-6-carboxylic acid dimethylamide; hydrochloride::CHEMBL553934
SMILES COc1ccc(CNc2nnc(N3CCC(O)CC3)c3ccc(cc23)C(=O)N(C)C)cc1Cl
InChI Key InChIKey=UDCMFXADQVNQQM-UHFFFAOYSA-N
Data  1 IC50
  Tab Delimited (TSV)   2D SDfile   Computed 3D by Vconf -m prep SDfile
Find this compound or compounds like it in BindingDB:
Activity Spreadsheet -- Enzyme Inhibition Constant Data from BindingDB
Found 1 hit for monomerid = 50089828
TargetcGMP-specific 3',5'-cyclic phosphodiesterase(Homo sapiens (Human))
Eisai
Curated by ChEMBL
LigandPNGBDBM50089828(4-(3-Chloro-4-methoxy-benzylamino)-1-(4-hydroxy-pi...)
Affinity DataIC50:  5.80E+4nM. Assay description: 50% inhibitory concentration against phosphodiesterase 5 (PDE5) from porcine platelets
In DepthDetails ArticlePubMed