BDBM50089833 4-(3-Chloro-4-methoxy-benzylamino)-1-piperidin-1-yl-phthalazine-6-carbonitrile; hydrochloride::CHEMBL553960
SMILES COc1ccc(CNc2nnc(N3CCCCC3)c3ccc(cc23)C#N)cc1Cl
InChI Key InChIKey=PVCWQTFCLBSOOB-UHFFFAOYSA-N
Data  1 IC50
  Tab Delimited (TSV)   2D SDfile   Computed 3D by Vconf -m prep SDfile
Find this compound or compounds like it in BindingDB:
Activity Spreadsheet -- Enzyme Inhibition Constant Data from BindingDB
Found 1 hit for monomerid = 50089833
TargetcGMP-specific 3',5'-cyclic phosphodiesterase(Homo sapiens (Human))
Eisai
Curated by ChEMBL
LigandPNGBDBM50089833(4-(3-Chloro-4-methoxy-benzylamino)-1-piperidin-1-y...)
Affinity DataIC50:  0.550nM. Assay description: 50% inhibitory concentration against phosphodiesterase 5 (PDE5) from porcine platelets
In DepthDetails ArticlePubMed