BDBM50089848 CHEMBL3577619
SMILES [H][C@@]12OC(C)(C)O[C@]([H])([C@H]1C)C(C)(C)[C@@H](CC)OC(=O)[C@H](C)[C@@H](OC(=O)NCCNC(=N)NC(=O)NC)[C@H](C)[C@@H](OCC#C)[C@](C)(O)C[C@H]2C
InChI Key InChIKey=BYUFDYITPHYTPY-LAGHAYQJSA-N
Data  1 IC50
  Tab Delimited (TSV)   2D SDfile   Computed 3D by Vconf -m prep SDfile
Find this compound or compounds like it in BindingDB:
Activity Spreadsheet -- Enzyme Inhibition Constant Data from BindingDB
Found 1 hit for monomerid = 50089848
TargetChitinase B(Serratia marcescens)
Kitasato University
Curated by ChEMBL
LigandPNGBDBM50089848(CHEMBL3577619)
Affinity DataIC50:  8.30E+3nM. Assay description: Inhibition of Serratia marcescens chitinase ChiB assessed as reduction in chitinolytic activity using 4MU-(GlcNAc)2 substrate by fluorescence based a...
In DepthDetails ArticlePubMed