BDBM50089894 2-(Amino-carboxy-methyl)-3-[2-(9H-xanthen-9-yl)-ethyl]-cyclopropanecarboxylic acid(XE-CCG-I)::CHEMBL90675
SMILES N[C@@H]([C@H]1[C@@H](CCC2c3ccccc3Oc3ccccc23)[C@@H]1C(O)=O)C(O)=O
InChI Key InChIKey=MBCWMEYAVJTLQS-QPZJVUEUSA-N
Data  2 KI
  Tab Delimited (TSV)   2D SDfile   Computed 3D by Vconf -m prep SDfile
Find this compound or compounds like it in BindingDB:
Activity Spreadsheet -- Enzyme Inhibition Constant Data from BindingDB
Found 2 hits for monomerid = 50089894
TargetMetabotropic glutamate receptor 2(Homo sapiens (Human))
The Royal Danish School Of Pharmacy
Curated by ChEMBL
LigandPNGBDBM50089894(2-(Amino-carboxy-methyl)-3-[2-(9H-xanthen-9-yl)-et...)
Affinity DataKi:  75nM. Assay description: Antagonist potency against cloned Metabotropic glutamate receptor 2
In DepthDetails ArticlePubMed
TargetMetabotropic glutamate receptor 3(Homo sapiens (Human))
The Royal Danish School Of Pharmacy
Curated by ChEMBL
LigandPNGBDBM50089894(2-(Amino-carboxy-methyl)-3-[2-(9H-xanthen-9-yl)-et...)
Affinity DataKi:  200nM. Assay description: Agonist potency against cloned Metabotropic glutamate receptor 3 (mGluR-3).
In DepthDetails ArticlePubMed