BDBM86213 CAS_5126051::CHEMBL327783::CPCCOEt::NSC_5126051
SMILES CCOC(=O)C12CC1C(N=O)c1ccccc1O2
InChI Key InChIKey=FINYWNDRBPWDDL-UHFFFAOYSA-N
Data  8 KI  3 IC50
  Tab Delimited (TSV)   2D SDfile   Computed 3D by Vconf -m prep SDfile
Find this compound or compounds like it in BindingDB:
Activity Spreadsheet -- Enzyme Inhibition Constant Data from BindingDB
Found 11 hits for monomerid = 86213
TargetMetabotropic glutamate receptor 1(RAT)
Johnson And Johnson Pharmaceutical Research And Development, Beerse
Curated by PDSP Ki Database
LigandPNGBDBM86213(CAS_5126051 | CHEMBL327783 | CPCCOEt | NSC_5126051)
Affinity DataKi:  1.00E+3nM
In DepthDetails ArticlePubMed
TargetMetabotropic glutamate receptor 1(RAT)
Johnson And Johnson Pharmaceutical Research And Development, Beerse
Curated by PDSP Ki Database
LigandPNGBDBM86213(CAS_5126051 | CHEMBL327783 | CPCCOEt | NSC_5126051)
Affinity DataKi:  4.90E+3nM
In DepthDetails ArticlePubMed
TargetMetabotropic glutamate receptor 1(Homo sapiens (Human))
The Royal Danish School Of Pharmacy
Curated by ChEMBL
LigandPNGBDBM86213(CAS_5126051 | CHEMBL327783 | CPCCOEt | NSC_5126051)
Affinity DataKi:  9.90E+3nM. Assay description: Agonist potency against cloned human metabotropic glutamate receptor 1
In DepthDetails ArticlePubMed
TargetMetabotropic glutamate receptor 5(Homo sapiens (Human))
The Royal Danish School Of Pharmacy
Curated by ChEMBL
LigandPNGBDBM86213(CAS_5126051 | CHEMBL327783 | CPCCOEt | NSC_5126051)
Affinity DataKi: >1.00E+5nM. Assay description: Agonist potency against cloned metabotropic glutamate receptor 5
In DepthDetails ArticlePubMed
TargetMetabotropic glutamate receptor 2(Homo sapiens (Human))
The Royal Danish School Of Pharmacy
Curated by ChEMBL
LigandPNGBDBM86213(CAS_5126051 | CHEMBL327783 | CPCCOEt | NSC_5126051)
Affinity DataKi: >1.00E+5nM. Assay description: Antagonist potency against cloned Metabotropic glutamate receptor 2
In DepthDetails ArticlePubMed
TargetMetabotropic glutamate receptor 4(Homo sapiens (Human))
The Royal Danish School Of Pharmacy
Curated by ChEMBL
LigandPNGBDBM86213(CAS_5126051 | CHEMBL327783 | CPCCOEt | NSC_5126051)
Affinity DataKi: >1.00E+5nM. Assay description: Agonist potency against cloned human Metabotropic glutamate receptor 4 (mGluR-4)
In DepthDetails ArticlePubMed
TargetMetabotropic glutamate receptor 8(Homo sapiens (Human))
The Royal Danish School Of Pharmacy
Curated by ChEMBL
LigandPNGBDBM86213(CAS_5126051 | CHEMBL327783 | CPCCOEt | NSC_5126051)
Affinity DataKi: >1.00E+5nM. Assay description: Agonist potency against cloned Metabotropic glutamate receptor 8 (mGluR-8).
In DepthDetails ArticlePubMed
TargetMetabotropic glutamate receptor 7(Homo sapiens (Human))
The Royal Danish School Of Pharmacy
Curated by ChEMBL
LigandPNGBDBM86213(CAS_5126051 | CHEMBL327783 | CPCCOEt | NSC_5126051)
Affinity DataKi: >1.00E+5nM. Assay description: Agonist potency against cloned Metabotropic glutamate receptor 7 (mGluR-7).
In DepthDetails ArticlePubMed
TargetMetabotropic glutamate receptor 1(Homo sapiens (Human))
The Royal Danish School Of Pharmacy
Curated by ChEMBL
LigandPNGBDBM86213(CAS_5126051 | CHEMBL327783 | CPCCOEt | NSC_5126051)
Affinity DataIC50:  6.60E+3nM. Assay description: Antagonist activity at human mGlu1b receptor
In DepthDetails ArticlePubMed
TargetMetabotropic glutamate receptor 1(Homo sapiens (Human))
The Royal Danish School Of Pharmacy
Curated by ChEMBL
LigandPNGBDBM86213(CAS_5126051 | CHEMBL327783 | CPCCOEt | NSC_5126051)
Affinity DataIC50:  2.30E+4nM. Assay description: Compound was tested for inhibition of glutamate-evoked (10 uM) [Ca2+] mobilization in mGluR1-alpha expressed-CHO cells.
In DepthDetails Article
TargetMetabotropic glutamate receptor 1(Homo sapiens (Human))
The Royal Danish School Of Pharmacy
Curated by ChEMBL
LigandPNGBDBM86213(CAS_5126051 | CHEMBL327783 | CPCCOEt | NSC_5126051)
Affinity DataIC50:  3.40E+3nM. Assay description: Inhibition of Quisqualate-Induced PI Hydrolysis measured in CHO Metabotropic glutamate receptor 1 Expressing Cells
In DepthDetails ArticlePubMed