BDBM50089957 CHEMBL3581227
SMILES CC(C)(C)c1cc(cc(c1O)C(C)(C)C)-c1csc(n1)C1(CCOCC1)N1CCOCC1
InChI Key InChIKey=ZIDOOIFRIVVMGK-UHFFFAOYSA-N
Data  1 KI
  Tab Delimited (TSV)   2D SDfile   Computed 3D by Vconf -m prep SDfile
Find this compound or compounds like it in BindingDB:
Activity Spreadsheet -- Enzyme Inhibition Constant Data from BindingDB
Found 1 hit for monomerid = 50089957
TargetCannabinoid receptor 2(Homo sapiens (Human))
Ipsen Innovation
Curated by ChEMBL
LigandPNGBDBM50089957(CHEMBL3581227)
Affinity DataKi:  177nM. Assay description: Displacement of [3H]CP55940 from human CB2 receptor expressed in CHO-K1 cell membrane by competitive displacement assay
In DepthDetails ArticlePubMed