BDBM50090010 4-(3,4-Difluoro-phenyl)-1,6-dimethyl-2-oxo-1,2,3,4-tetrahydro-pyrimidine-5-carboxylic acid {3-[4-(2-cyano-4-fluoro-phenyl)-piperidin-1-yl]-propyl}-amide::CHEMBL89927
SMILES CN1C(=O)N[C@@H](C(C(=O)NCCCN2CCC(CC2)c2ccc(F)cc2C#N)=C1C)c1ccc(F)c(F)c1
InChI Key InChIKey=UYWFSEXEAMKGLC-AREMUKBSSA-N
Data  3 KI
  Tab Delimited (TSV)   2D SDfile   Computed 3D by Vconf -m prep SDfile
Find this compound or compounds like it in BindingDB:
Activity Spreadsheet -- Enzyme Inhibition Constant Data from BindingDB
Found 3 hits for monomerid = 50090010
TargetAlpha-1A adrenergic receptor(Homo sapiens (Human))
Merck Research Laboratories
Curated by ChEMBL
LigandPNGBDBM50090010(4-(3,4-Difluoro-phenyl)-1,6-dimethyl-2-oxo-1,2,3,4...)
Affinity DataKi:  0.120nM. Assay description: Evaluated for the ability to displace [125I]- HEAT from human cloned Alpha-1A adrenergic receptor stably expressed in CHO cells.
In DepthDetails ArticlePubMed
TargetAlpha-1B adrenergic receptor(Homo sapiens (Human))
Merck Research Laboratories
Curated by ChEMBL
LigandPNGBDBM50090010(4-(3,4-Difluoro-phenyl)-1,6-dimethyl-2-oxo-1,2,3,4...)
Affinity DataKi:  130nM. Assay description: Evaluated for the ability to displace [125I]- HEAT from human cloned Alpha-1B adrenergic receptor stably expressed in LM cells.
In DepthDetails ArticlePubMed
TargetAlpha-1D adrenergic receptor(Homo sapiens (Human))
Merck Research Laboratories
Curated by ChEMBL
LigandPNGBDBM50090010(4-(3,4-Difluoro-phenyl)-1,6-dimethyl-2-oxo-1,2,3,4...)
Affinity DataKi:  340nM. Assay description: Evaluated for the ability to displace [125I]- HEAT from human cloned Alpha-1D adrenergic receptor stably expressed in HEK cells.
In DepthDetails ArticlePubMed