BDBM50090137 7-[(1R,2R,3R,5S)-3,5-Dihydroxy-2-((R)-3-hydroxy-4,4-dimethyl-octyl)-cyclopentyl]-heptanoic acid::CHEMBL285412
SMILES CCCCC(C)(C)[C@H](O)CC[C@H]1[C@H](O)C[C@H](O)[C@@H]1CCCCCCC(O)=O
InChI Key InChIKey=NWYKVXPSSKITNL-OUUBHVDSSA-N
Data  1 IC50  4 EC50
  Tab Delimited (TSV)   2D SDfile   Computed 3D by Vconf -m prep SDfile
Find this compound or compounds like it in BindingDB:
Activity Spreadsheet -- Enzyme Inhibition Constant Data from BindingDB
Found 5 hits for monomerid = 50090137
TargetThromboxane A2 receptor(Homo sapiens (Human))
Procter & Gamble Pharmaceuticals
Curated by ChEMBL
LigandPNGBDBM50090137(7-[(1R,2R,3R,5S)-3,5-Dihydroxy-2-((R)-3-hydroxy-4,...)
Affinity DataEC50: >2.00E+4nM. Assay description: Functional activity in RAT-1cells, transiently-transfected with human TP-receptor (% of control ligand, [3H]-U-46,619<20%)
In DepthDetails ArticlePubMed
TargetProstaglandin E2 receptor EP1 subtype(Homo sapiens (Human))
Procter & Gamble Pharmaceuticals
Curated by ChEMBL
LigandPNGBDBM50090137(7-[(1R,2R,3R,5S)-3,5-Dihydroxy-2-((R)-3-hydroxy-4,...)
Affinity DataEC50: >2.00E+4nM. Assay description: Functional activity in RAT-1cells, transiently-transfected with human Prostaglandin E receptor EP1 (% of control ligand, 17-phi-PGE2<20%)
In DepthDetails ArticlePubMed
TargetProstaglandin F2-alpha receptor(Homo sapiens (Human))
Procter & Gamble Pharmaceuticals
Curated by ChEMBL
LigandPNGBDBM50090137(7-[(1R,2R,3R,5S)-3,5-Dihydroxy-2-((R)-3-hydroxy-4,...)
Affinity DataIC50: >1.00E+3nM. Assay description: Displacement of [3H]-PGF2-alpha from human FP-receptor expressed in CHO-KI cells
In DepthDetails ArticlePubMed
TargetProstaglandin F2-alpha receptor(Homo sapiens (Human))
Procter & Gamble Pharmaceuticals
Curated by ChEMBL
LigandPNGBDBM50090137(7-[(1R,2R,3R,5S)-3,5-Dihydroxy-2-((R)-3-hydroxy-4,...)
Affinity DataEC50: >2.00E+4nM. Assay description: Functional activity in RAT-1cells, transiently-transfected with human FP-receptor (% of control ligand, fluprostenol<20%)
In DepthDetails ArticlePubMed
TargetProstaglandin E2 receptor EP3 subtype(Homo sapiens (Human))
Procter & Gamble Pharmaceuticals
Curated by ChEMBL
LigandPNGBDBM50090137(7-[(1R,2R,3R,5S)-3,5-Dihydroxy-2-((R)-3-hydroxy-4,...)
Affinity DataEC50: >2.00E+4nM. Assay description: Functional activity in RAT-1cells, transiently-transfected with human Prostaglandin E receptor EP3 (% of control ligand, sulprostone<20%)
In DepthDetails ArticlePubMed