BDBM50090229 CHEMBL3581645
SMILES CC\C(=C(/c1ccc2[nH]ncc2c1)c1ccc(\C=C\C(O)=O)cc1OC)c1ccccc1
InChI Key InChIKey=LMANLGXMQRKGKV-HWRWZSNVSA-N
Data  1 EC50
  Tab Delimited (TSV)   2D SDfile   Computed 3D by Vconf -m prep SDfile
Find this compound or compounds like it in BindingDB:
Activity Spreadsheet -- Enzyme Inhibition Constant Data from BindingDB
Found 1 hit for monomerid = 50090229
TargetEstrogen receptor(Homo sapiens (Human))
Seragon Pharmaceuticals
Curated by ChEMBL
LigandPNGBDBM50090229(CHEMBL3581645)
Affinity DataEC50:  4nM. Assay description: Induction of estrogen receptor-alpha degradation in human MCF7 cells after 4 hrs by in-cell western assay
In DepthDetails ArticlePubMed