BDBM50090266 Aminoglycoside analogue::Tob-Tob dimer::Tobramycin-Tobramycin
SMILES NC[C@H]1O[C@H](O[C@@H]2[C@@H](N)C[C@@H](N)[C@H](O[C@H]3O[C@H](CSCCOCCSSCCOCCSC[C@H]4O[C@H](O[C@H]5[C@H](N)C[C@H](N)[C@@H](O[C@H]6O[C@H](CN)[C@@H](O)C[C@H]6N)[C@@H]5O)[C@H](O)[C@@H](N)[C@@H]4O)[C@@H](O)[C@H](N)[C@H]3O)[C@H]2O)[C@H](N)C[C@@H]1O
InChI Key InChIKey=DRKCFEIKVASKQV-HWJHIZAWSA-N
Data  1 Kd
  Tab Delimited (TSV)   2D SDfile   Computed 3D by Vconf -m prep SDfile
Find this compound or compounds like it in BindingDB:
Activity Spreadsheet -- Enzyme Inhibition Constant Data from BindingDB
Found 1 hit for monomerid = 50090266
TargetProtein Rev(Human immunodeficiency virus 1)
Purdue University
Curated by ChEMBL
LigandPNGBDBM50090266(Aminoglycoside analogue | Tob-Tob dimer | Tobramyc...)
Affinity DataKd:  3.69E+3nM. Assay description: Tetsed for the ability to bind the HIV-1 RRE-RNA construct by fluorescence anisotropy
In DepthDetails ArticlePubMed