BDBM50090287 2-Diphenylacetylamino-5-guanidino-pentanoic acid (S)-indan-1-ylamide::CHEMBL40430
SMILES NC(=N)NCCCC(NC(=O)C(c1ccccc1)c1ccccc1)C(=O)N[C@H]1CCc2ccccc12
InChI Key InChIKey=SEFXLRXUTBGZIN-SKCDSABHSA-N
Data  1 IC50
  Tab Delimited (TSV)   2D SDfile   Computed 3D by Vconf -m prep SDfile
Find this compound or compounds like it in BindingDB:
Activity Spreadsheet -- Enzyme Inhibition Constant Data from BindingDB
Found 1 hit for monomerid = 50090287
TargetNeuropeptide Y receptor type 1(Homo sapiens (Human))
University Of Regensburg
Curated by ChEMBL
LigandPNGBDBM50090287(2-Diphenylacetylamino-5-guanidino-pentanoic acid (...)
Affinity DataIC50:  1.40E+3nM. Assay description: NPY Y1-antagonistic activity in HEL cells by measuring the inhibition of porcine NPY (10 nM) stimulated increase in the intracellular [Ca2+] concentr...
In DepthDetails ArticlePubMed