BDBM50090315 4-Phenyl-1-[3-(2-p-tolyl-acetylamino)-propyl]-piperidine-4-carboxylic acid methyl ester::CHEMBL43799
SMILES COC(=O)C1(CCN(CCCNC(=O)Cc2ccc(C)cc2)CC1)c1ccccc1
InChI Key InChIKey=RLWVXIUJPCHTSK-UHFFFAOYSA-N
Data  6 KI
  Tab Delimited (TSV)   2D SDfile   Computed 3D by Vconf -m prep SDfile
Find this compound or compounds like it in BindingDB:
Activity Spreadsheet -- Enzyme Inhibition Constant Data from BindingDB
Found 6 hits for monomerid = 50090315
TargetAlpha-1A adrenergic receptor(Homo sapiens (Human))
Merck
Curated by ChEMBL
LigandPNGBDBM50090315(4-Phenyl-1-[3-(2-p-tolyl-acetylamino)-propyl]-pipe...)
Affinity DataKi:  74nM. Assay description: In vitro binding affinity towards cloned human Alpha-1A adrenergic receptor
In DepthDetails ArticlePubMed
TargetAlpha-1A adrenergic receptor(Homo sapiens (Human))
Merck
Curated by ChEMBL
LigandPNGBDBM50090315(4-Phenyl-1-[3-(2-p-tolyl-acetylamino)-propyl]-pipe...)
Affinity DataKi:  74nM. Assay description: Inhibition of binding of [125I]-HEAT to cloned human alpha-1A adrenergic receptor.
In DepthDetails ArticlePubMed
TargetAlpha-1B adrenergic receptor(Homo sapiens (Human))
Merck
Curated by ChEMBL
LigandPNGBDBM50090315(4-Phenyl-1-[3-(2-p-tolyl-acetylamino)-propyl]-pipe...)
Affinity DataKi: >3.00E+3nM. Assay description: Inhibition of binding of [125I]-HEAT to cloned human alpha-1B adrenergic receptor.
In DepthDetails ArticlePubMed
TargetAlpha-1B adrenergic receptor(Homo sapiens (Human))
Merck
Curated by ChEMBL
LigandPNGBDBM50090315(4-Phenyl-1-[3-(2-p-tolyl-acetylamino)-propyl]-pipe...)
Affinity DataKi: >3.00E+3nM. Assay description: In vitro binding affinity towards cloned human Alpha-1B adrenergic receptor
In DepthDetails ArticlePubMed
TargetAlpha-1D adrenergic receptor(Homo sapiens (Human))
Merck
Curated by ChEMBL
LigandPNGBDBM50090315(4-Phenyl-1-[3-(2-p-tolyl-acetylamino)-propyl]-pipe...)
Affinity DataKi:  3.40E+3nM. Assay description: Inhibition of binding of [125I]-HEAT to cloned human alpha-1D adrenergic receptor.
In DepthDetails ArticlePubMed
TargetAlpha-1D adrenergic receptor(Homo sapiens (Human))
Merck
Curated by ChEMBL
LigandPNGBDBM50090315(4-Phenyl-1-[3-(2-p-tolyl-acetylamino)-propyl]-pipe...)
Affinity DataKi:  3.40E+3nM. Assay description: In vitro binding affinity towards cloned human Alpha-1D adrenergic receptor
In DepthDetails ArticlePubMed