BDBM50090514 CHEMBL3581736
SMILES Fc1ccc(NS(=O)(=O)c2cc3CCN(C(=O)Nc4ccc(cc4)C(F)(F)F)c3c(c2)N2CCNC2=O)c(F)c1
InChI Key InChIKey=YVXDLDVRCSNFPF-UHFFFAOYSA-N
Data  1 IC50
  Tab Delimited (TSV)   2D SDfile   Computed 3D by Vconf -m prep SDfile
Find this compound or compounds like it in BindingDB:
Activity Spreadsheet -- Enzyme Inhibition Constant Data from BindingDB
Found 1 hit for monomerid = 50090514
TargetAlpha-1,6-mannosyl-glycoprotein 2-beta-N-acetylglucosaminyltransferase(Homo sapiens (Human))
Takeda Pharmaceutical
Curated by ChEMBL
LigandPNGBDBM50090514(CHEMBL3581736)
Affinity DataIC50:  2.5nM. Assay description: In vitro inhibition of full length human MGAT2 transfected in FreeStyle293 cells assessed as dioleoylglycerol by RapidFire/MS assay
In DepthDetails ArticlePubMed