BDBM50090536 2-[1-(Toluene-4-sulfonyl)-1H-indol-6-yl]-octahydro-pyrrolo[1,2-a]pyrazine::CHEMBL47691
SMILES Cc1ccc(cc1)S(=O)(=O)n1ccc2ccc(cc12)N1CCN2CCCC2C1
InChI Key InChIKey=LOCNIBUPFGMZHY-UHFFFAOYSA-N
Data  1 KI
  Tab Delimited (TSV)   2D SDfile   Computed 3D by Vconf -m prep SDfile
Find this compound or compounds like it in BindingDB:
Activity Spreadsheet -- Enzyme Inhibition Constant Data from BindingDB
Found 1 hit for monomerid = 50090536
Target5-hydroxytryptamine receptor 6(Homo sapiens (Human))
Nps Allelix
Curated by ChEMBL
LigandPNGBDBM50090536(2-[1-(Toluene-4-sulfonyl)-1H-indol-6-yl]-octahydro...)
Affinity DataKi:  3.30nM. Assay description: Displacement of [3H]-LSD from human 5-hydroxytryptamine 6 receptor expressed in HEK 293 cells
In DepthDetails ArticlePubMed