BDBM50090537 7-Chloro-3-(2-chloro-biphenyl-4-yl)-6-nitro-4-(2-piperidin-2-yl-ethoxy)-1H-quinolin-2-one::CHEMBL49028
SMILES [O-][N+](=O)c1cc2c(OCCC3CCCCN3)c(-c3ccc(c(Cl)c3)-c3ccccc3)c(=[OH+])[n-]c2cc1Cl
InChI Key InChIKey=VDQDGNRGFYPXKV-UHFFFAOYSA-N
Data  1 IC50
  Tab Delimited (TSV)   2D SDfile   Computed 3D by Vconf -m prep SDfile
Find this compound or compounds like it in BindingDB:
Activity Spreadsheet -- Enzyme Inhibition Constant Data from BindingDB
Found 1 hit for monomerid = 50090537
TargetGonadotropin-releasing hormone receptor(Rattus norvegicus)
Merck Research Laboratories
Curated by ChEMBL
LigandPNGBDBM50090537(7-Chloro-3-(2-chloro-biphenyl-4-yl)-6-nitro-4-(2-p...)
Affinity DataIC50:  900nM. Assay description: Antagonist activity against Gonadotropin-releasing hormone receptor (GnRHr) in rat pituitary cells
In DepthDetails ArticlePubMed