BDBM50090867 (2R,3S,4R,5R)-2-(aminomethyl)-5-(4-chloro-5-iodo-7H-pyrrolo[2,3-d]pyrimidin-7-yl)-tetrahydrofuran-3,4-diol::(2R,3S,4R,5R)-2-Aminomethyl-5-(4-chloro-5-iodo-pyrrolo[2,3-d]pyrimidin-7-yl)-tetrahydro-furan-3,4-diol::2-Aminomethyl-5-(4-chloro-5-iodo-pyrrolo[2,3-d]pyrimidin-7-yl)-tetrahydro-furan-3,4-diol::CHEMBL330432
SMILES NC[C@H]1O[C@H]([C@H](O)[C@@H]1O)n1cc(I)c2c(Cl)ncnc12
InChI Key InChIKey=QATUTGXCWAHTTP-IOSLPCCCSA-N
Data  4 IC50
  Tab Delimited (TSV)   2D SDfile   Computed 3D by Vconf -m prep SDfile
Find this compound or compounds like it in BindingDB:
Activity Spreadsheet -- Enzyme Inhibition Constant Data from BindingDB
Found 4 hits for monomerid = 50090867
TargetAdenosine kinase(Homo sapiens (Human))
Metabasis Therapeutics
Curated by ChEMBL
LigandPNGBDBM50090867((2R,3S,4R,5R)-2-(aminomethyl)-5-(4-chloro-5-iodo-7...)
Affinity DataIC50:  0.100nM. Assay description: Inhibition of recombinant human adenosine kinase
In DepthDetails ArticlePubMed
TargetAdenosine kinase(Homo sapiens (Human))
Metabasis Therapeutics
Curated by ChEMBL
LigandPNGBDBM50090867((2R,3S,4R,5R)-2-(aminomethyl)-5-(4-chloro-5-iodo-7...)
Affinity DataIC50:  1.00E+5nM. Assay description: Inhibition of adenosine kinase (unknown origin)
In DepthDetails Article
TargetAdenosine kinase(Homo sapiens (Human))
Metabasis Therapeutics
Curated by ChEMBL
LigandPNGBDBM50090867((2R,3S,4R,5R)-2-(aminomethyl)-5-(4-chloro-5-iodo-7...)
Affinity DataIC50:  0.100nM. Assay description: Concentration required for 50% inhibition of the adenosine kinase (AK) activity.
In DepthDetails ArticlePubMed
TargetAdenosine kinase(Homo sapiens (Human))
Metabasis Therapeutics
Curated by ChEMBL
LigandPNGBDBM50090867((2R,3S,4R,5R)-2-(aminomethyl)-5-(4-chloro-5-iodo-7...)
Affinity DataIC50:  0.100nM. Assay description: Inhibition of human adenosine kinase activity
In DepthDetails ArticlePubMed