BDBM50090931 CHEMBL100761::L-Arg NO2-(N-CH3)-L-Lys-NH2
SMILES CN([C@@H](CCCCN)C(N)=O)C(=O)[C@@H](N)CCCNC(=N)N[N+]([O-])=O
InChI Key InChIKey=IBZDYDRXYTXAPL-UWVGGRQHSA-N
Data  3 KI
  Tab Delimited (TSV)   2D SDfile   Computed 3D by Vconf -m prep SDfile
Find this compound or compounds like it in BindingDB:
Activity Spreadsheet -- Enzyme Inhibition Constant Data from BindingDB
Found 3 hits for monomerid = 50090931
TargetNitric oxide synthase, brain(Homo sapiens (Human))
Northwestern University
Curated by ChEMBL
LigandPNGBDBM50090931(CHEMBL100761 | L-Arg NO2-(N-CH3)-L-Lys-NH2)
Affinity DataKi:  7.30E+3nM. Assay description: Binding affinity against bovine brain nNOS (neuronal).
In DepthDetails ArticlePubMed
TargetNitric oxide synthase, endothelial(Bos taurus (bovine))
Northwestern University
Curated by ChEMBL
LigandPNGBDBM50090931(CHEMBL100761 | L-Arg NO2-(N-CH3)-L-Lys-NH2)
Affinity DataKi:  6.31E+5nM. Assay description: Binding affinity against recombinant bovine Endothelial nitric oxide synthase.
In DepthDetails ArticlePubMed
TargetNitric oxide synthase, inducible(Mus musculus (mouse))
Northwestern University
Curated by ChEMBL
LigandPNGBDBM50090931(CHEMBL100761 | L-Arg NO2-(N-CH3)-L-Lys-NH2)
Affinity DataKi:  1.90E+6nM. Assay description: Binding affinity against recombinant murine Inducible nitric oxide synthase.
In DepthDetails ArticlePubMed