BDBM50090936 CHEMBL101042::L-Arg NO2-(N-CH3)-L-Orn-NH2
SMILES CN([C@@H](CCCN)C(N)=O)C(=O)[C@@H](N)CCCNC(=N)N[N+]([O-])=O
InChI Key InChIKey=MOSLFQPVECZYJW-IUCAKERBSA-N
Data  3 KI
  Tab Delimited (TSV)   2D SDfile   Computed 3D by Vconf -m prep SDfile
Find this compound or compounds like it in BindingDB:
Activity Spreadsheet -- Enzyme Inhibition Constant Data from BindingDB
Found 3 hits for monomerid = 50090936
TargetNitric oxide synthase, brain(Homo sapiens (Human))
Northwestern University
Curated by ChEMBL
LigandPNGBDBM50090936(CHEMBL101042 | L-Arg NO2-(N-CH3)-L-Orn-NH2)
Affinity DataKi:  4.60E+3nM. Assay description: Binding affinity against bovine brain nNOS (neuronal).
In DepthDetails ArticlePubMed
TargetNitric oxide synthase, endothelial(Bos taurus (bovine))
Northwestern University
Curated by ChEMBL
LigandPNGBDBM50090936(CHEMBL101042 | L-Arg NO2-(N-CH3)-L-Orn-NH2)
Affinity DataKi:  6.23E+5nM. Assay description: Binding affinity against recombinant bovine Endothelial nitric oxide synthase.
In DepthDetails ArticlePubMed
TargetNitric oxide synthase, inducible(Mus musculus (mouse))
Northwestern University
Curated by ChEMBL
LigandPNGBDBM50090936(CHEMBL101042 | L-Arg NO2-(N-CH3)-L-Orn-NH2)
Affinity DataKi:  1.30E+6nM. Assay description: Binding affinity against recombinant murine Inducible nitric oxide synthase.
In DepthDetails ArticlePubMed