BDBM50090943 3-(2-{4-[3-(2-Bromo-6-chloro-phenyl)-5-isopropyl-isoxazol-4-ylmethoxy]-2-chloro-phenyl}-vinyl)-benzoic acid::CHEMBL101381
SMILES CC(C)c1onc(c1COc1ccc(\C=C\c2cccc(c2)C(O)=O)c(Cl)c1)-c1c(Cl)cccc1Br
InChI Key InChIKey=TZFMRKSUIBOKIY-MDZDMXLPSA-N
Data  1 EC50
  Tab Delimited (TSV)   2D SDfile   Computed 3D by Vconf -m prep SDfile
Find this compound or compounds like it in BindingDB:
Activity Spreadsheet -- Enzyme Inhibition Constant Data from BindingDB
Found 1 hit for monomerid = 50090943
TargetBile acid receptor(Homo sapiens (Human))
Glaxo Wellcome Research & Development
Curated by ChEMBL
LigandPNGBDBM50090943(3-(2-{4-[3-(2-Bromo-6-chloro-phenyl)-5-isopropyl-i...)
Affinity DataEC50:  12nM. Assay description: Ligand dependent recruitment of SRC1(676-700) peptide to human Farnesoid X-activated receptor by fluorescence resonance energy transfer assay
In DepthDetails ArticlePubMed