BDBM50091017 2-(8-Hydroxy-6,11-dimethyl-1,2,5,6-tetrahydro-4H-2,6-methano-benzo[d]azocin-3-ylmethyl)-1-phenyl-cyclopropanecarboxylic acid {[1-(3-butyrimidoylamino-propylcarbamoyl)-3-methyl-butylcarbamoyl]-methyl}-amide::CHEMBL319524
SMILES CCCC(=N)NCCCNC(=O)C(CC(C)C)NC(=O)CNC(=O)[C@@]1(CC1CN1CC[C@]2(C)C(C)C1Cc1ccc(O)cc21)c1ccccc1
InChI Key InChIKey=WLOZTXXGYJQLBS-YOCHMOBJSA-N
Data  3 KI
  Tab Delimited (TSV)   2D SDfile   Computed 3D by Vconf -m prep SDfile
Find this compound or compounds like it in BindingDB:
Activity Spreadsheet -- Enzyme Inhibition Constant Data from BindingDB
Found 3 hits for monomerid = 50091017
TargetKappa-type opioid receptor(Cavia porcellus (domestic guinea pig))
University Of Catania
Curated by ChEMBL
LigandPNGBDBM50091017(2-(8-Hydroxy-6,11-dimethyl-1,2,5,6-tetrahydro-4H-2...)
Affinity DataKi:  81nM. Assay description: Displacement of [3H]-U-69,593 from Opioid receptor kappa 1 in guinea pig cerebellar.
In DepthDetails ArticlePubMed
TargetDelta-type opioid receptor(Rattus norvegicus (rat))
University Of Catania
Curated by ChEMBL
LigandPNGBDBM50091017(2-(8-Hydroxy-6,11-dimethyl-1,2,5,6-tetrahydro-4H-2...)
Affinity DataKi:  9.54E+3nM. Assay description: Displacement of [3H]diprenorphine opioid receptor delta 1 on crude membrane fractions obtained from the whole rat brain (minus cerebellum)
In DepthDetails ArticlePubMed
TargetMu-type opioid receptor(Rattus norvegicus (rat))
University Of Catania
Curated by ChEMBL
LigandPNGBDBM50091017(2-(8-Hydroxy-6,11-dimethyl-1,2,5,6-tetrahydro-4H-2...)
Affinity DataKi:  1.07E+4nM. Assay description: Displacement of [3H]diprenorphine from opioid receptor mu 1 on crude membrane fractions obtained from whole rat brain (minus cerebellum)
In DepthDetails ArticlePubMed