BDBM50091058 CHEMBL3582128
SMILES C[C@@]1(O)c2c(CCO)coc2C(=O)c2c3CCC(=O)c3ccc12
InChI Key InChIKey=XQHKJDRMFLGXOP-SFHVURJKSA-N
Data  1 IC50
  Tab Delimited (TSV)   2D SDfile   Computed 3D by Vconf -m prep SDfile
Find this compound or compounds like it in BindingDB:
Activity Spreadsheet -- Enzyme Inhibition Constant Data from BindingDB
Found 1 hit for monomerid = 50091058
TargetAmyloid-beta precursor protein(Homo sapiens (Human))
Jinan University
Curated by ChEMBL
LigandPNGBDBM50091058(CHEMBL3582128)
Affinity DataIC50:  3.43E+4nM. Assay description: Inhibition of amyloid beta (1 to 42) (unknown origin) aggregation incubated at 37 degC for 16 hrs by thioflavin T fluorescence assay
In DepthDetails ArticlePubMed