BDBM50091099 4'-(2-Methyl-oxazol-4-yl)-biphenyl-2-sulfonic acid (3,4-dimethyl-isoxazol-5-yl)-amide::CHEMBL106846
SMILES Cc1nc(co1)-c1ccc(cc1)-c1ccccc1S(=O)(=O)Nc1onc(C)c1C
InChI Key InChIKey=NLXBGPMWVJISIR-UHFFFAOYSA-N
Data  2 KI
  Tab Delimited (TSV)   2D SDfile   Computed 3D by Vconf -m prep SDfile
Find this compound or compounds like it in BindingDB:
Activity Spreadsheet -- Enzyme Inhibition Constant Data from BindingDB
Found 2 hits for monomerid = 50091099
TargetEndothelin-1 receptor(Homo sapiens (Human))
Bristol-Myers Squibb Pharmaceutical Research Institute
Curated by ChEMBL
LigandPNGBDBM50091099(4'-(2-Methyl-oxazol-4-yl)-biphenyl-2-sulfonic acid...)
Affinity DataKi:  70nM. Assay description: Inhibition of Human Endothelin A receptor expressed in CHO Cells.
In DepthDetails ArticlePubMed
TargetEndothelin receptor type B(Homo sapiens (Human))
Bristol-Myers Squibb Pharmaceutical Research Institute
Curated by ChEMBL
LigandPNGBDBM50091099(4'-(2-Methyl-oxazol-4-yl)-biphenyl-2-sulfonic acid...)
Affinity DataKi:  1.10E+5nM. Assay description: Inihibition of Human Endothelin B receptor expressed in CHO Cells.
In DepthDetails ArticlePubMed