BDBM50091266 CHEMBL3582150
SMILES COc1ccc(CCC(=O)O[C@@H]2Cc3c(OC)cc(OC)cc3O[C@@H]2c2cc(OC)c(OC)c(OC)c2)cc1
InChI Key InChIKey=QYZKXRXZXGTMSY-XRKRLSELSA-N
Data  1 IC50
  Tab Delimited (TSV)   2D SDfile   Computed 3D by Vconf -m prep SDfile
Find this compound or compounds like it in BindingDB:
Activity Spreadsheet -- Enzyme Inhibition Constant Data from BindingDB
Found 1 hit for monomerid = 50091266
TargetATP-dependent translocase ABCB1(Homo sapiens (Human))
The Hong Kong Polytechnic University
Curated by ChEMBL
LigandPNGBDBM50091266(CHEMBL3582150)
Affinity DataIC50:  40nM. Assay description: Modulation of P-gp (unknown origin) transfected in human MDA435/LCC6MDR cells assessed as reversible of paclitaxel resistance measured as IC50 for pa...
In DepthDetails ArticlePubMed