BDBM50091290 CHEMBL3582204
SMILES CC1(C)CCCN(Cc2ccc(cc2)-c2cnc3[nH]c4cnc(cc4c3c2)C#N)C1
InChI Key InChIKey=KOGFSINKMHAXKX-UHFFFAOYSA-N
Data  2 IC50  1 EC50
  Tab Delimited (TSV)   2D SDfile   Computed 3D by Vconf -m prep SDfile
Find this compound or compounds like it in BindingDB:
Activity Spreadsheet -- Enzyme Inhibition Constant Data from BindingDB
Found 3 hits for monomerid = 50091290
TargetSerine/threonine-protein kinase Chk1(Homo sapiens (Human))
Argenta Discovery
Curated by ChEMBL
LigandPNGBDBM50091290(CHEMBL3582204)
Affinity DataIC50:  9.40nM. Assay description: Inhibition of human recombinant Chk1 using biotinylated AKT substrate after 30 mins by Alphascreen biochemical assay
In DepthDetails ArticlePubMed
TargetSerine/threonine-protein kinase Chk1(Homo sapiens (Human))
Argenta Discovery
Curated by ChEMBL
LigandPNGBDBM50091290(CHEMBL3582204)
Affinity DataEC50:  128nM. Assay description: Inhibition of CHK1 in human HT29 cells assessed as phosphorylation of histone H3 after 24 hrs by checkpoint abrogation cellular assay
In DepthDetails ArticlePubMed
TargetAcetylcholinesterase(Homo sapiens (Human))
Argenta Discovery
Curated by ChEMBL
LigandPNGBDBM50091290(CHEMBL3582204)
Affinity DataIC50:  3.33E+3nM. Assay description: Inhibition of human acetylcholine esterase by horseradish peroxidase-coupled fluorescence assay
In DepthDetails ArticlePubMed