BDBM50091337 CHEMBL3582265
SMILES C[C@H](Cc1ccccc1C)C1=NCCN1
InChI Key InChIKey=HDBLYESYOKKSIO-LLVKDONJSA-N
Data  1 KI
  Tab Delimited (TSV)   2D SDfile   Computed 3D by Vconf -m prep SDfile
Find this compound or compounds like it in BindingDB:
Activity Spreadsheet -- Enzyme Inhibition Constant Data from BindingDB
Found 1 hit for monomerid = 50091337
TargetNischarin(RAT)
University Of Camerino
Curated by ChEMBL
LigandPNGBDBM50091337(CHEMBL3582265)
Affinity DataKi:  1.05E+3nM. Assay description: Displacement of [125I]-p-iodoclonidin from I1-imidazoline receptor in rat PC12 cell membranes
In DepthDetails ArticlePubMed