BDBM50091427 3-(3'-Amino-biphenyl-4-yl)-8-methyl-8-aza-bicyclo[3.2.1]octane-2-carboxylic acid methyl ester::CHEMBL50674
SMILES COC(=O)C1C2CCC(CC1c1ccc(cc1)-c1cccc(N)c1)N2C
InChI Key InChIKey=FNFCKPGBCJVUBJ-UHFFFAOYSA-N
Data  2 KI
  Tab Delimited (TSV)   2D SDfile   Computed 3D by Vconf -m prep SDfile
Find this compound or compounds like it in BindingDB:
Activity Spreadsheet -- Enzyme Inhibition Constant Data from BindingDB
Found 2 hits for monomerid = 50091427
TargetSodium-dependent dopamine transporter(Rattus norvegicus (rat))
Yale University
Curated by ChEMBL
LigandPNGBDBM50091427(3-(3'-Amino-biphenyl-4-yl)-8-methyl-8-aza-bicyclo[...)
Affinity DataKi:  24nM. Assay description: Displacement of [3H]-GBR-12,935 from rat forebrain Dopamine transporter
In DepthDetails ArticlePubMed
TargetSodium-dependent serotonin transporter(Rattus norvegicus (rat))
Yale University
Curated by ChEMBL
LigandPNGBDBM50091427(3-(3'-Amino-biphenyl-4-yl)-8-methyl-8-aza-bicyclo[...)
Affinity DataKi:  67nM. Assay description: Affinity for Serotonin transporter by displacing [3H]-Paroxetine from rat forebrain
In DepthDetails ArticlePubMed