BDBM50091611 1-[2-Hydroxy-4-(2-hydroxy-indan-1-ylcarbamoyl)-5-phenyl-pentyl]-4-(2-methoxy-pyridin-3-ylmethyl)-piperazine-2-carboxylic acid tert-butylamide::CHEMBL323882
SMILES COc1ncccc1CN1CCN(C[C@@H](O)C[C@@H](Cc2ccccc2)C(=O)NC2[C@H](O)Cc3ccccc23)[C@@H](C1)C(=O)NC(C)(C)C
InChI Key InChIKey=NMHZNRIVIFPIMI-CAXFYQCDSA-N
Data  1 IC50
  Tab Delimited (TSV)   2D SDfile   Computed 3D by Vconf -m prep SDfile
Find this compound or compounds like it in BindingDB:
Activity Spreadsheet -- Enzyme Inhibition Constant Data from BindingDB
Found 1 hit for monomerid = 50091611
TargetGag-Pol polyprotein [489-587](Human immunodeficiency virus type 1)
Merck Research Laboratories
Curated by ChEMBL
LigandPNGBDBM50091611(1-[2-Hydroxy-4-(2-hydroxy-indan-1-ylcarbamoyl)-5-p...)
Affinity DataIC50:  1.10nM. Assay description: Inhibition of HIV-1 protease in vitro.
In DepthDetails ArticlePubMed