BDBM50091752 (S)-3-{(2S,3S)-2-[(S)-5-Guanidino-2-(2-{4-[(naphthalene-2-carbonyl)-amino]-phenyl}-acetylamino)-pentanoylamino]-3-methyl-pentanoylamino}-N-[(S)-1-((S)-2-methyl-butylcarbamoyl)-ethyl]-succinamic acid::CHEMBL61383
SMILES CC[C@H](C)CNC(=O)[C@H](C)NC(=O)[C@H](CC(O)=O)NC(=O)[C@@H](NC(=O)[C@H](CCCNC(N)=N)NC(=O)Cc1ccc(NC(=O)c2ccc3ccccc3c2)cc1)[C@@H](C)CC
InChI Key InChIKey=FUVHGJXBAITLDM-BIUJTGHWSA-N
Data  2 KI
  Tab Delimited (TSV)   2D SDfile   Computed 3D by Vconf -m prep SDfile
Find this compound or compounds like it in BindingDB:
Activity Spreadsheet -- Enzyme Inhibition Constant Data from BindingDB
Found 2 hits for monomerid = 50091752
TargetAtrial natriuretic peptide receptor 1(Homo sapiens (Human))
Astrazeneca Pharmaceuticals
Curated by ChEMBL
LigandPNGBDBM50091752((S)-3-{(2S,3S)-2-[(S)-5-Guanidino-2-(2-{4-[(naphth...)
Affinity DataKi:  0.400nM. Assay description: Displacement of [125I]- ANP from the Atrial natriuretic peptide receptor A.
In DepthDetails ArticlePubMed
TargetAtrial natriuretic peptide receptor 3(Homo sapiens (Human))
Astrazeneca Pharmaceuticals
Curated by ChEMBL
LigandPNGBDBM50091752((S)-3-{(2S,3S)-2-[(S)-5-Guanidino-2-(2-{4-[(naphth...)
Affinity DataKi:  0.400nM. Assay description: Displacement of [125I]- ANP from the Atrial Natriuretic Peptide Clearance Receptor.
In DepthDetails ArticlePubMed