BDBM50092315 (1-Cyclohexyl-piperidin-4-yl)-[4-(4-methoxy-benzenesulfonyl)-phenyl]-acetonitrile::CHEMBL69595
SMILES COc1ccc(cc1)S(=O)(=O)c1ccc(cc1)C(C#N)C1CCN(CC1)C1CCCCC1
InChI Key InChIKey=QDDPQJCCXUPHKY-UHFFFAOYSA-N
Data  2 KI
  Tab Delimited (TSV)   2D SDfile   Computed 3D by Vconf -m prep SDfile
Find this compound or compounds like it in BindingDB:
Activity Spreadsheet -- Enzyme Inhibition Constant Data from BindingDB
Found 2 hits for monomerid = 50092315
TargetMuscarinic acetylcholine receptor M2(Homo sapiens (Human))
Schering-Plough Research Institute
Curated by ChEMBL
LigandPNGBDBM50092315((1-Cyclohexyl-piperidin-4-yl)-[4-(4-methoxy-benzen...)
Affinity DataKi:  1.30nM. Assay description: Binding affinity against Muscarinic acetylcholine receptor M2
In DepthDetails ArticlePubMed
TargetMuscarinic acetylcholine receptor M1(Homo sapiens (Human))
Schering-Plough Research Institute
Curated by ChEMBL
LigandPNGBDBM50092315((1-Cyclohexyl-piperidin-4-yl)-[4-(4-methoxy-benzen...)
Affinity DataKi:  16nM. Assay description: Binding affinity against Muscarinic acetylcholine receptor M1
In DepthDetails ArticlePubMed