BDBM50092369 7-Bromo-1-(3H-imidazol-4-ylmethyl)-4-methanesulfonyl-3-phenethyl-2,3,4,5-tetrahydro-1H-benzo[e][1,4]diazepine::CHEMBL334073
SMILES CS(=O)(=O)N1Cc2cc(Br)ccc2N(Cc2cnc[nH]2)CC1CCc1ccccc1
InChI Key InChIKey=OMODHEKCMZABQT-UHFFFAOYSA-N
Data  1 IC50
  Tab Delimited (TSV)   2D SDfile   Computed 3D by Vconf -m prep SDfile
Find this compound or compounds like it in BindingDB:
Activity Spreadsheet -- Enzyme Inhibition Constant Data from BindingDB
Found 1 hit for monomerid = 50092369
TargetDimer of Protein farnesyltransferase subunit beta(Homo sapiens (Human))
Bristol-Myers Squibb Pharmaceutical Research Institute
Curated by ChEMBL
LigandPNGBDBM50092369(7-Bromo-1-(3H-imidazol-4-ylmethyl)-4-methanesulfon...)
Affinity DataIC50:  45nM. Assay description: Inhibition of purified recombinant human farnesyltransferase (FT)
In DepthDetails ArticlePubMed