BDBM50092402 CHEMBL122872::N-(1-Carbamoyl-2-phenyl-ethyl)-3-(2-{[3-(1H-indol-3-yl)-2-propionylamino-propionyl]-methyl-amino}-hexanoylamino)-succinamic acid
SMILES CCCC[C@H](N(C)C(=O)[C@H](Cc1c[nH]c2ccccc12)NC(=O)CC)C(=O)N[C@@H](CC(O)=O)C(=O)N[C@@H](Cc1ccccc1)C(N)=O
InChI Key InChIKey=RVDPZIJSKACWLV-LJWNLINESA-N
Data  2 KI
  Tab Delimited (TSV)   2D SDfile   Computed 3D by Vconf -m prep SDfile
Find this compound or compounds like it in BindingDB:
Activity Spreadsheet -- Enzyme Inhibition Constant Data from BindingDB
Found 2 hits for monomerid = 50092402
TargetCholecystokinin receptor type A(Cavia porcellus)
University Of Paris
Curated by ChEMBL
LigandPNGBDBM50092402(CHEMBL122872 | N-(1-Carbamoyl-2-phenyl-ethyl)-3-(2...)
Affinity DataKi:  4.35nM. Assay description: Affinity against Cholecystokinin type A receptor on guinea pig pancreatic membranes.
In DepthDetails ArticlePubMed
TargetGastrin/cholecystokinin type B receptor(Homo sapiens (Human))
University Of Paris
Curated by ChEMBL
LigandPNGBDBM50092402(CHEMBL122872 | N-(1-Carbamoyl-2-phenyl-ethyl)-3-(2...)
Affinity DataKi: >6.00E+3nM. Assay description: Binding affinity against cholecystokinin type B receptor on guinea pig cortex.
In DepthDetails ArticlePubMed