BDBM50092416 3-(2-{[2-(3-Amino-propionylamino)-3-(1H-indol-3-yl)-propionyl]-methyl-amino}-hexanoylamino)-N-(1-carbamoyl-2-phenyl-ethyl)-succinamic acid::CHEMBL122012
SMILES CCCC[C@H](N(C)C(=O)[C@H](Cc1c[nH]c2ccccc12)NC(=O)CCN)C(=O)N[C@@H](CC(O)=O)C(=O)N[C@@H](Cc1ccccc1)C(N)=O
InChI Key InChIKey=RWQOGEKAEWOOPX-LJWNLINESA-N
Data  1 KI
  Tab Delimited (TSV)   2D SDfile   Computed 3D by Vconf -m prep SDfile
Find this compound or compounds like it in BindingDB:
Activity Spreadsheet -- Enzyme Inhibition Constant Data from BindingDB
Found 1 hit for monomerid = 50092416
TargetGastrin/cholecystokinin type B receptor(Homo sapiens (Human))
University Of Paris
Curated by ChEMBL
LigandPNGBDBM50092416(3-(2-{[2-(3-Amino-propionylamino)-3-(1H-indol-3-yl...)
Affinity DataKi:  95nM. Assay description: Binding affinity against cholecystokinin type B receptor on guinea pig cortex.
In DepthDetails ArticlePubMed