BDBM50092504 8-methyl-3,4,5,6-Tetrahydrobenzo[c]quinolizin-3-(4aH)-one::CHEMBL419602
SMILES Cc1ccc2N3C=CC(=O)CC3CCc2c1
InChI Key InChIKey=AJJNTDGBWHZORI-UHFFFAOYSA-N
Data  1 IC50
  Tab Delimited (TSV)   2D SDfile   Computed 3D by Vconf -m prep SDfile
Find this compound or compounds like it in BindingDB:
Activity Spreadsheet -- Enzyme Inhibition Constant Data from BindingDB
Found 1 hit for monomerid = 50092504
Target3-oxo-5-alpha-steroid 4-dehydrogenase 1(Homo sapiens (Human))
Universit£
Curated by ChEMBL
LigandPNGBDBM50092504(8-methyl-3,4,5,6-Tetrahydrobenzo[c]quinolizin-3-(4...)
Affinity DataIC50:  176nM. Assay description: Inhibition of recombinant steroid 5-alpha-reductase type I expressed in CHO cells
In DepthDetails ArticlePubMed