BDBM50092556 4-Amino-5-chloro-2-methoxy-benzoic acid 2-[4-(4-fluoro-phenyl)-piperazin-1-yl]-ethyl ester::CHEMBL333028
SMILES COc1cc(N)c(Cl)cc1C(=O)OCCN1CCN(CC1)c1ccc(F)cc1
InChI Key InChIKey=AHSZYFPXZMOGPF-UHFFFAOYSA-N
Data  1 KI
  Tab Delimited (TSV)   2D SDfile   Computed 3D by Vconf -m prep SDfile
Find this compound or compounds like it in BindingDB:
Activity Spreadsheet -- Enzyme Inhibition Constant Data from BindingDB
Found 1 hit for monomerid = 50092556
Target5-hydroxytryptamine receptor 4(Homo sapiens (Human))
Paris-Sud University
Curated by ChEMBL
LigandPNGBDBM50092556(4-Amino-5-chloro-2-methoxy-benzoic acid 2-[4-(4-fl...)
Affinity DataKi:  23.1nM. Assay description: Binding affinity was determined against cloned 5-hydroxytryptamine 4E receptor isoform expressed in C6 glial cells incubated with 0.2 nM [3H]-GR-113,...
In DepthDetails ArticlePubMed