BDBM50092565 (2R,5R,11bS,1'R)-3-[(2-Benzyloxycarbonylamino-3-oxo-2,3,5,6,11,11b-hexahydro-1H-indolizino[8,7-b]indole-5-carbonyl)-amino]-4-phenyl-butyric acid methyl ester::CHEMBL435407
SMILES COC(=O)C[C@@H](Cc1ccccc1)NC(=O)[C@H]1Cc2c([nH]c3ccccc23)[C@@H]2C[C@@H](NC(=O)OCc3ccccc3)C(=O)N12
InChI Key InChIKey=PTONYPXFMSECSH-HYJYBNJOSA-N
Data  2 IC50
  Tab Delimited (TSV)   2D SDfile   Computed 3D by Vconf -m prep SDfile
Find this compound or compounds like it in BindingDB:
Activity Spreadsheet -- Enzyme Inhibition Constant Data from BindingDB
Found 2 hits for monomerid = 50092565
TargetCholecystokinin receptor type A(RAT)
Instituto De Qu£Mica M£Dica (Csic)
Curated by ChEMBL
LigandPNGBDBM50092565((2R,5R,11bS,1'R)-3-[(2-Benzyloxycarbonylamino-3-ox...)
Affinity DataIC50: >1.00E+3nM. Assay description: In vitro inhibition of [3H]propionyl-CCK-8 binding to rat pancreatic membranes at Cholecystokinin type A receptor.
In DepthDetails ArticlePubMed
TargetGastrin/cholecystokinin type B receptor(RAT)
Instituto De Qu£Mica M£Dica (Csic)
Curated by ChEMBL
LigandPNGBDBM50092565((2R,5R,11bS,1'R)-3-[(2-Benzyloxycarbonylamino-3-ox...)
Affinity DataIC50:  4.91E+3nM. Assay description: In vitro inhibition of [3H]propionyl-CCK-8 binding to rat cerebral cortex membranes at Cholecystokinin type B receptor.
In DepthDetails ArticlePubMed