BDBM50092964 4-{1-[4-(4-Methoxy-benzenesulfonyl)-phenyl]-vinyl}-[1,4']bipiperidinyl-1'-carboxylic acid methyl ester::CHEMBL307234::methyl 4-(4-(1-(4-(4-methoxyphenylsulfonyl)phenyl)vinyl)piperidin-1-yl)piperidine-1-carboxylate
SMILES COC(=O)N1CCC(CC1)N1CCC(CC1)C(=C)c1ccc(cc1)S(=O)(=O)c1ccc(OC)cc1
InChI Key InChIKey=FLIWZNAGCZIAIW-UHFFFAOYSA-N
Data  3 KI
  Tab Delimited (TSV)   2D SDfile   Computed 3D by Vconf -m prep SDfile
Find this compound or compounds like it in BindingDB:
Activity Spreadsheet -- Enzyme Inhibition Constant Data from BindingDB
Found 3 hits for monomerid = 50092964
TargetMuscarinic acetylcholine receptor M2(Homo sapiens (Human))
Schering-Plough Research Institute
Curated by ChEMBL
LigandPNGBDBM50092964(4-{1-[4-(4-Methoxy-benzenesulfonyl)-phenyl]-vinyl}...)
Affinity DataKi:  0.990nM. Assay description: Binding affinity against Muscarinic acetylcholine receptor M2 stably expressed in CHO-K1 cells.
In DepthDetails ArticlePubMed
TargetMuscarinic acetylcholine receptor M2(Homo sapiens (Human))
Schering-Plough Research Institute
Curated by ChEMBL
LigandPNGBDBM50092964(4-{1-[4-(4-Methoxy-benzenesulfonyl)-phenyl]-vinyl}...)
Affinity DataKi:  0.991nM. Assay description: Binding affinity to muscarinic M2 receptor
In DepthDetails ArticlePubMed
TargetMuscarinic acetylcholine receptor M1(Homo sapiens (Human))
Shanghai Jiao Tong University School Of Medicine
Curated by ChEMBL
LigandPNGBDBM50092964(4-{1-[4-(4-Methoxy-benzenesulfonyl)-phenyl]-vinyl}...)
Affinity DataKi:  60nM. Assay description: Binding affinity to muscarinic M1 receptor
In DepthDetails ArticlePubMed