BDBM50093099 1-(3,5-Bis-trifluoromethyl-benzyloxy)-3-(3,4-dichloro-phenyl)-5-(4-pyrimidin-2-yl-piperazin-1-yl)-pentan-2-one O-methyl-oxime::CHEMBL306052
SMILES CO\N=C(/COCc1cc(cc(c1)C(F)(F)F)C(F)(F)F)C(CCN1CCN(CC1)c1ncccn1)c1ccc(Cl)c(Cl)c1
InChI Key InChIKey=VCWSHBPPIYZVOZ-IHELAITMSA-N
Data  2 KI
  Tab Delimited (TSV)   2D SDfile   Computed 3D by Vconf -m prep SDfile
Find this compound or compounds like it in BindingDB:
Activity Spreadsheet -- Enzyme Inhibition Constant Data from BindingDB
Found 2 hits for monomerid = 50093099
TargetSubstance-P receptor(Homo sapiens (Human))
Schering-Plough Research Institute
Curated by ChEMBL
LigandPNGBDBM50093099(1-(3,5-Bis-trifluoromethyl-benzyloxy)-3-(3,4-dichl...)
Affinity DataKi:  70nM. Assay description: Inhibitory activity against human tachykinin receptor 1
In DepthDetails ArticlePubMed
TargetSubstance-K receptor(Homo sapiens (Human))
Schering-Plough Research Institute
Curated by ChEMBL
LigandPNGBDBM50093099(1-(3,5-Bis-trifluoromethyl-benzyloxy)-3-(3,4-dichl...)
Affinity DataKi:  217nM. Assay description: Inhibitory activity against human tachykinin receptor 2
In DepthDetails ArticlePubMed