BDBM50093319 3-{4-[5-(2,6-Dimethyl-piperidin-1-yl)-pentyl]-3-oxo-3,4-dihydro-2H-benzo[1,4]oxazin-2-yl}-N-hydroxy-benzamidine::CHEMBL134137
SMILES CC1CCCC(C)N1CCCCCN1C(=O)C(Oc2ccccc12)c1cccc(c1)C(=N)NO
InChI Key InChIKey=GBNBQTSYMGOUTA-UHFFFAOYSA-N
Data  1 IC50
  Tab Delimited (TSV)   2D SDfile   Computed 3D by Vconf -m prep SDfile
Find this compound or compounds like it in BindingDB:
Activity Spreadsheet -- Enzyme Inhibition Constant Data from BindingDB
Found 1 hit for monomerid = 50093319
TargetCoagulation factor X(Homo sapiens (Human))
Pfizer
Curated by ChEMBL
LigandPNGBDBM50093319(3-{4-[5-(2,6-Dimethyl-piperidin-1-yl)-pentyl]-3-ox...)
Affinity DataIC50:  5.60E+3nM. Assay description: In vitro inhibition of coagulation factor Xa.
In DepthDetails ArticlePubMed