BDBM50093364 2-(3,4,5-Trimethoxy-phenyl)-1H-benzoimidazole-4-carboxylic acid amide::CHEMBL132834
SMILES COc1cc(cc(OC)c1OC)-c1nc2c(cccc2[nH]1)C(N)=O
InChI Key InChIKey=OBHBPKWDBYTINS-UHFFFAOYSA-N
Data  1 KI
  Tab Delimited (TSV)   2D SDfile   Computed 3D by Vconf -m prep SDfile
Find this compound or compounds like it in BindingDB:
Activity Spreadsheet -- Enzyme Inhibition Constant Data from BindingDB
Found 1 hit for monomerid = 50093364
TargetPoly [ADP-ribose] polymerase 1(Homo sapiens (Human))
Newcastle University
Curated by ChEMBL
LigandPNGBDBM50093364(2-(3,4,5-Trimethoxy-phenyl)-1H-benzoimidazole-4-ca...)
Affinity DataKi:  136nM. Assay description: In vitro inhibition against human full length PARP protein
In DepthDetails ArticlePubMed