BDBM50093386 2-(4-Hydroxy-3-methoxy-phenyl)-1H-benzoimidazole-4-carboxylic acid amide::CHEMBL133976
SMILES COc1cc(ccc1O)-c1nc2c(cccc2[nH]1)C(N)=O
InChI Key InChIKey=DHZPWLFSOLXEBY-UHFFFAOYSA-N
Data  1 KI
  Tab Delimited (TSV)   2D SDfile   Computed 3D by Vconf -m prep SDfile
Find this compound or compounds like it in BindingDB:
Activity Spreadsheet -- Enzyme Inhibition Constant Data from BindingDB
Found 1 hit for monomerid = 50093386
TargetPoly [ADP-ribose] polymerase 1(Homo sapiens (Human))
Newcastle University
Curated by ChEMBL
LigandPNGBDBM50093386(2-(4-Hydroxy-3-methoxy-phenyl)-1H-benzoimidazole-4...)
Affinity DataKi:  13nM. Assay description: In vitro inhibition against human full length PARP protein
In DepthDetails ArticlePubMed