BDBM50093544 CHEMBL3585744
SMILES Cn1c(CN2C(=O)CN(C2=O)c2ccc(Oc3ccccc3)cc2)nc2ccc(cc12)C(=O)N[C@@H](CCCCN)C#N
InChI Key InChIKey=OLDACSSKZUPCOJ-QFIPXVFZSA-N
Data  1 IC50
  Tab Delimited (TSV)   2D SDfile   Computed 3D by Vconf -m prep SDfile
Find this compound or compounds like it in BindingDB:
Activity Spreadsheet -- Enzyme Inhibition Constant Data from BindingDB
Found 1 hit for monomerid = 50093544
TargetPlasminogen(Homo sapiens (Human))
Hiroshima International University
Curated by ChEMBL
LigandPNGBDBM50093544(CHEMBL3585744)
Affinity DataIC50:  2.50E+4nM. Assay description: Inhibition of plasmin (unknown origin) using Boc-Val-Leu-Lys-MCA as substrate by fluorescence analysis
In DepthDetails ArticlePubMed