BDBM50093657 CHEMBL137613::Furan-2-ylmethyl-methyl-(2-methyl-6-phenyl-5H-pyrrolo[3,2-d]pyrimidin-4-yl)-amine
SMILES CN(Cc1ccco1)c1nc(C)nc2cc([nH]c12)-c1ccccc1
InChI Key InChIKey=SCFACXFDVDBMNL-UHFFFAOYSA-N
Data  1 IC50
  Tab Delimited (TSV)   2D SDfile   Computed 3D by Vconf -m prep SDfile
Find this compound or compounds like it in BindingDB:
Activity Spreadsheet -- Enzyme Inhibition Constant Data from BindingDB
Found 1 hit for monomerid = 50093657
TargetNeuropeptide Y receptor type 5(Homo sapiens (Human))
Amgen
Curated by ChEMBL
LigandPNGBDBM50093657(CHEMBL137613 | Furan-2-ylmethyl-methyl-(2-methyl-6...)
Affinity DataIC50:  52nM. Assay description: Affinity for human neuropeptide Y receptor Y5, binding was evaluated in an in vitro radioligand [125I]-PYY binding assay
In DepthDetails ArticlePubMed