BDBM50093659 6-Benzo[b]thiophen-2-yl-2-methyl-4-piperidin-1-yl-5H-pyrrolo[3,2-d]pyrimidine::CHEMBL137260
SMILES Cc1nc(N2CCCCC2)c2[nH]c(cc2n1)-c1cc2ccccc2s1
InChI Key InChIKey=NVKKJHXNQMXJRD-UHFFFAOYSA-N
Data  1 IC50
  Tab Delimited (TSV)   2D SDfile   Computed 3D by Vconf -m prep SDfile
Find this compound or compounds like it in BindingDB:
Activity Spreadsheet -- Enzyme Inhibition Constant Data from BindingDB
Found 1 hit for monomerid = 50093659
TargetNeuropeptide Y receptor type 5(Homo sapiens (Human))
Amgen
Curated by ChEMBL
LigandPNGBDBM50093659(6-Benzo[b]thiophen-2-yl-2-methyl-4-piperidin-1-yl-...)
Affinity DataIC50:  140nM. Assay description: Affinity for human neuropeptide Y receptor Y5, binding was evaluated in an in vitro radioligand [125I]-PYY binding assay
In DepthDetails ArticlePubMed