BDBM50093666 6-Butyl-2-methyl-4-piperidin-1-yl-5H-pyrrolo[3,2-d]pyrimidine::CHEMBL137638
SMILES CCCCc1cc2nc(C)nc(N3CCCCC3)c2[nH]1
InChI Key InChIKey=BDNJXFJPBVAQPR-UHFFFAOYSA-N
Data  1 IC50
  Tab Delimited (TSV)   2D SDfile   Computed 3D by Vconf -m prep SDfile
Find this compound or compounds like it in BindingDB:
Activity Spreadsheet -- Enzyme Inhibition Constant Data from BindingDB
Found 1 hit for monomerid = 50093666
TargetNeuropeptide Y receptor type 5(Homo sapiens (Human))
Amgen
Curated by ChEMBL
LigandPNGBDBM50093666(6-Butyl-2-methyl-4-piperidin-1-yl-5H-pyrrolo[3,2-d...)
Affinity DataIC50:  10nM. Assay description: Affinity for human neuropeptide Y receptor Y5, binding was evaluated in an in vitro radioligand [125I]-PYY binding assay
In DepthDetails ArticlePubMed