BDBM50093684 2-Cyclopropyl-6-phenyl-4-piperidin-1-yl-5H-pyrrolo[3,2-d]pyrimidine::CHEMBL137530
SMILES C1CC1c1nc(N2CCCCC2)c2[nH]c(cc2n1)-c1ccccc1
InChI Key InChIKey=JNPKAIZUBKUVSE-UHFFFAOYSA-N
Data  1 IC50
  Tab Delimited (TSV)   2D SDfile   Computed 3D by Vconf -m prep SDfile
Find this compound or compounds like it in BindingDB:
Activity Spreadsheet -- Enzyme Inhibition Constant Data from BindingDB
Found 1 hit for monomerid = 50093684
TargetNeuropeptide Y receptor type 5(Homo sapiens (Human))
Amgen
Curated by ChEMBL
LigandPNGBDBM50093684(2-Cyclopropyl-6-phenyl-4-piperidin-1-yl-5H-pyrrolo...)
Affinity DataIC50:  32nM. Assay description: Affinity for human neuropeptide Y receptor Y5, binding was evaluated in an in vitro radioligand [125I]-PYY binding assay
In DepthDetails ArticlePubMed